BDBM50220013 (5R)-3-{3-fluoro-4-[6-(piperidin-4-ylacetyl)pyridin-3-yl]phenyl}-5-(1H-1,2,3-triazol-1-ylmethyl)-1,3-oxazolidin-2-one::CHEMBL231481
SMILES Fc1cc(ccc1-c1ccc(nc1)C(=O)CC1CCNCC1)N1C[C@H](Cn2ccnn2)OC1=O
InChI Key InChIKey=RGVKJPIMWPUCPK-IBGZPJMESA-N
Data  1 KI
  Tab Delimited (TSV)   2D SDfile   Computed 3D by Vconf -m prep SDfile
Find this compound or compounds like it in BindingDB:
Activity Spreadsheet -- Enzyme Inhibition Constant Data from BindingDB
Found 1 hit for monomerid = 50220013
TargetAmine oxidase [flavin-containing] A(Homo sapiens (Human))
Astrazeneca Discovery
Curated by ChEMBL
LigandPNGBDBM50220013((5R)-3-{3-fluoro-4-[6-(piperidin-4-ylacetyl)pyridi...)
Affinity DataKi:  2.80E+4nM. Assay description: Inhibition of human liver MAOA expressed in yeast
In DepthDetails ArticlePubMed