BDBM50220047 (1S,9R,18R,19S,21R,22R,23R,25R,32S,34R,35R,36S)-15,31-bis[(4-bromophenyl)methyl]-24-phenyl-10,26-dioxa-8,15,24,31-tetraazaundecacyclo[29.5.2.0^{1,32}.0^{2,7}.0^{8,36}.0^{9,22}.0^{13,21}.0^{15,19}.0^{18,23}.0^{25,35}.0^{29,34}]octatriaconta-2,4,6,12,28-pentaene-15,31-diium dibromide::CHEMBL388046
SMILES Brc1ccc(C[N+]23CC[C@H]4[C@@H]2C[C@@H]2[C@@H]5[C@@H]4N([C@@H]4OCC=C6C[N+]7(Cc8ccc(Br)cc8)CC[C@@]89[C@@H]7C[C@@H]6[C@@H]4[C@@H]8N([C@@H]5OCC=C2C3)c2ccccc92)c2ccccc2)cc1
InChI Key InChIKey=XDSPKYGOPLCTEA-YIGIZFADSA-N
Data  3 KI  3 IC50
  Tab Delimited (TSV)   2D SDfile   Computed 3D by Vconf -m prep SDfile
Find this compound or compounds like it in BindingDB:
Activity Spreadsheet -- Enzyme Inhibition Constant Data from BindingDB
Found 6 hits for monomerid = 50220047
TargetNeuronal acetylcholine receptor subunit alpha-7(Homo sapiens (Human))
University Of Copenhagen
Curated by ChEMBL
LigandPNGBDBM50220047((1S,9R,18R,19S,21R,22R,23R,25R,32S,34R,35R,36S)-15...)
Affinity DataKi:  260nM. Assay description: Displacement of [3H]methyllycaconitine from human alpha-7 in tsA201 cells coexpressed with 5HT3A receptor
In DepthDetails ArticlePubMed
TargetNeuronal acetylcholine receptor subunit alpha-7(Homo sapiens (Human))
University Of Copenhagen
Curated by ChEMBL
LigandPNGBDBM50220047((1S,9R,18R,19S,21R,22R,23R,25R,32S,34R,35R,36S)-15...)
Affinity DataKi:  640nM. Assay description: Displacement of [3H]methyllycaconitine from alpha7 nAChR in tsA201 cells co-expressed with Ric3
In DepthDetails ArticlePubMed
Target5-hydroxytryptamine receptor 3A(Homo sapiens (Human))
University Of Copenhagen
Curated by ChEMBL
LigandPNGBDBM50220047((1S,9R,18R,19S,21R,22R,23R,25R,32S,34R,35R,36S)-15...)
Affinity DataKi:  5.70E+3nM. Assay description: Displacement of [3H]GR65630 from human 5HT3A receptor in HEK293 cells
In DepthDetails ArticlePubMed
Target5-hydroxytryptamine receptor 3A(Homo sapiens (Human))
University Of Copenhagen
Curated by ChEMBL
LigandPNGBDBM50220047((1S,9R,18R,19S,21R,22R,23R,25R,32S,34R,35R,36S)-15...)
Affinity DataIC50:  3.16E+4nM. Assay description: Antagonist activity at human 5HT3A receptor expressed in HEK293 cells by FMP assay
In DepthDetails ArticlePubMed
TargetNeuronal acetylcholine receptor subunit alpha-7(Homo sapiens (Human))
University Of Copenhagen
Curated by ChEMBL
LigandPNGBDBM50220047((1S,9R,18R,19S,21R,22R,23R,25R,32S,34R,35R,36S)-15...)
Affinity DataIC50:  1.00E+4nM. Assay description: Antagonist activity at human alpha-7 nAChR in tsA201 cells coexpressed with Ric3 by FMP assay
In DepthDetails ArticlePubMed
TargetGlycine receptor subunit alpha-1(Homo sapiens (Human))
University Of Copenhagen
Curated by ChEMBL
LigandPNGBDBM50220047((1S,9R,18R,19S,21R,22R,23R,25R,32S,34R,35R,36S)-15...)
Affinity DataIC50: >1.00E+5nM. Assay description: Antagonist activity at human glycine alpha-1 receptor in HEK293 cells by FMP assay
In DepthDetails ArticlePubMed