BDBM50220183 CHEMBL429467::N-[4'-(trifluoroacetyl)-4-biphenylyl]urea
SMILES NC(=O)Nc1ccc(cc1)-c1ccc(cc1)C(=O)C(F)(F)F
InChI Key InChIKey=BTUGOSNWWGFHMY-UHFFFAOYSA-N
Data  1 IC50
  Tab Delimited (TSV)   2D SDfile   Computed 3D by Vconf -m prep SDfile
Find this compound or compounds like it in BindingDB:
Activity Spreadsheet -- Enzyme Inhibition Constant Data from BindingDB
Found 1 hit for monomerid = 50220183
TargetKinesin-like protein KIF11(Homo sapiens (Human))
Glaxosmithkline
Curated by ChEMBL
LigandPNGBDBM50220183(CHEMBL429467 | N-[4'-(trifluoroacetyl)-4-biphenyly...)
Affinity DataIC50: >2.00E+4nM. Assay description: Inhibition of human KSP motor domain by ATPase assay
In DepthDetails ArticlePubMed