BDBM50220207 4'-(trifluoromethyl)-4-biphenylol::CHEMBL244264
SMILES Oc1ccc(cc1)-c1ccc(cc1)C(F)(F)F
InChI Key InChIKey=AFPOYLCQXONCPX-UHFFFAOYSA-N
Data  1 IC50
  Tab Delimited (TSV)   2D SDfile   Computed 3D by Vconf -m prep SDfile
Find this compound or compounds like it in BindingDB:
Activity Spreadsheet -- Enzyme Inhibition Constant Data from BindingDB
Found 1 hit for monomerid = 50220207
TargetKinesin-like protein KIF11(Homo sapiens (Human))
Glaxosmithkline
Curated by ChEMBL
LigandPNGBDBM50220207(4'-(trifluoromethyl)-4-biphenylol | CHEMBL244264)
Affinity DataIC50:  700nM. Assay description: Inhibition of human KSP motor domain by ATPase assay
In DepthDetails ArticlePubMed