BDBM50220329 (S)-1-(3-(2,5-difluorophenyl)-5-(3-((2-methoxyethyl)(methyl)amino)propyl)-5-phenyl-4,5-dihydropyrazol-1-yl)ethanone::CHEMBL240705
SMILES COCCN(C)CCC[C@]1(CC(=NN1C(C)=O)c1cc(F)ccc1F)c1ccccc1
InChI Key InChIKey=HLNVHFJBICUAIR-DEOSSOPVSA-N
Data  1 IC50
  Tab Delimited (TSV)   2D SDfile   Computed 3D by Vconf -m prep SDfile
Find this compound or compounds like it in BindingDB:
Activity Spreadsheet -- Enzyme Inhibition Constant Data from BindingDB
Found 1 hit for monomerid = 50220329
TargetKinesin-like protein KIF11(Homo sapiens (Human))
Merck Research Laboratories
Curated by ChEMBL
LigandPNGBDBM50220329((S)-1-(3-(2,5-difluorophenyl)-5-(3-((2-methoxyethy...)
Affinity DataIC50:  2nM. Assay description: Inhibition of KSP by ATPase assay
In DepthDetails ArticlePubMed