BDBM50220359 (+/-)-tetrahydro-2H-pyran-2-ylmethyl benzoate::CHEMBL231179
SMILES O=C(OCC1CCCCO1)c1ccccc1
InChI Key InChIKey=QEXRPTJIVSKKTN-UHFFFAOYSA-N
Data  2 IC50
  Tab Delimited (TSV)   2D SDfile   Computed 3D by Vconf -m prep SDfile
Find this compound or compounds like it in BindingDB:
Activity Spreadsheet -- Enzyme Inhibition Constant Data from BindingDB
Found 2 hits for monomerid = 50220359
TargetMonoglyceride lipase(Rattus norvegicus (Rat))
Universidad Complutense
Curated by ChEMBL
LigandPNGBDBM50220359((+/-)-tetrahydro-2H-pyran-2-ylmethyl benzoate | CH...)
Affinity DataIC50:  3.00E+3nM. Assay description: Inhibition of MGL in rat cerebellum cytosolic fractions assessed as [3H]-2-oleoglycerol hydrolysis
In DepthDetails ArticlePubMed
TargetFatty-acid amide hydrolase 1 [30-579](Rattus norvegicus (rat))
Universidad Complutense
Curated by ChEMBL
LigandPNGBDBM50220359((+/-)-tetrahydro-2H-pyran-2-ylmethyl benzoate | CH...)
Affinity DataIC50:  5.30E+4nM. Assay description: Inhibition of FAAH in rat cerebellum membranes assessed as [3H]anandamide hydrolysis
In DepthDetails ArticlePubMed