BDBM50220617 CHEMBL47928
SMILES Cc1cc(NC(=O)C(=O)NC(C)(C)C)ccc1-c1cnco1
InChI Key InChIKey=LLNWFRAFZDPXES-UHFFFAOYSA-N
Data  1 IC50
  Tab Delimited (TSV)   2D SDfile   Computed 3D by Vconf -m prep SDfile
Find this compound or compounds like it in BindingDB:
Activity Spreadsheet -- Enzyme Inhibition Constant Data from BindingDB
Found 1 hit for monomerid = 50220617
TargetInosine-5'-monophosphate dehydrogenase 1/2(Homo sapiens (Human))
Roche Discovery Welwyn
Curated by ChEMBL
LigandPNGBDBM50220617(CHEMBL47928)
Affinity DataIC50:  200nM. Assay description: Inhibitory activity against (IMPDH) inosine 5'-monophosphate dehydrogenase
In DepthDetails ArticlePubMed