BDBM50220934 3-(4-(3-((7R,8R,9S,10R,13S,14S,17S)-17-hydroxy-10,13,17-trimethyl-3-oxo-2,3,6,7,8,9,10,11,12,13,14,15,16,17-tetradecahydro-1H-cyclopenta[a]phenanthren-7-yl)propyl)phenoxy)propanoic acid::CHEMBL235661
SMILES C[C@]1(O)CC[C@H]2[C@@H]3[C@H](CCCc4ccc(OCCC(O)=O)cc4)CC4=CC(=O)CC[C@]4(C)[C@H]3CC[C@]12C
InChI Key InChIKey=SNRZNTGHDVJRHR-LFIWHKQASA-N
Data  2 IC50
  Tab Delimited (TSV)   2D SDfile   Computed 3D by Vconf -m prep SDfile
Find this compound or compounds like it in BindingDB:
Activity Spreadsheet -- Enzyme Inhibition Constant Data from BindingDB
Found 2 hits for monomerid = 50220934
TargetAndrogen receptor(Homo sapiens (Human))
Chugai Pharmaceutical
Curated by ChEMBL
LigandPNGBDBM50220934(3-(4-(3-((7R,8R,9S,10R,13S,14S,17S)-17-hydroxy-10,...)
Affinity DataIC50:  300nM. Assay description: Displacement of [3H]mibolerone from human androgen receptor expressed in CHOK1 cells
In DepthDetails ArticlePubMed
TargetAndrogen receptor(Homo sapiens (Human))
Chugai Pharmaceutical
Curated by ChEMBL
LigandPNGBDBM50220934(3-(4-(3-((7R,8R,9S,10R,13S,14S,17S)-17-hydroxy-10,...)
Affinity DataIC50:  170nM. Assay description: Antagonist activity at human androgen receptor expressed in HeLa cells assessed as inhibition of dihydrotestosterone induced transcriptional activity...
In DepthDetails ArticlePubMed