BDBM50221491 CHEMBL327167
SMILES [H][C@@]1(O[C@H]([C@H](OC(=O)OCCCCCCCC)[C@@H]1OC)n1ccc(=O)[nH]c1=O)[C@@H](O[C@H]1OC(=C[C@H](O)[C@@H]1O)C(=O)N[C@H]1CCC[C@@H](C)NC1=O)C(N)=O
InChI Key InChIKey=YFRVYZYZXUOXJL-LHVHEXEASA-N
Data  1 IC50
  Tab Delimited (TSV)   2D SDfile   Computed 3D by Vconf -m prep SDfile
Find this compound or compounds like it in BindingDB:
Activity Spreadsheet -- Enzyme Inhibition Constant Data from BindingDB
Found 1 hit for monomerid = 50221491
TargetPhospho-N-acetylmuramoyl-pentapeptide-transferase(Escherichia coli (strain K12))
Sankyo
Curated by ChEMBL
LigandPNGBDBM50221491(CHEMBL327167)
Affinity DataIC50:  675nM. Assay description: Inhibitory concentration required against Translocase I
In DepthDetails ArticlePubMed