BDBM50222064 (E)-2-(5-bromothiophen-2-yl)-N-((1-(1-(pyridin-4-yl)piperidine-4-carbonyl)pyrrolidin-3-yl)methyl)ethenesulfonamide::CHEMBL249832
SMILES Brc1ccc(\C=C\S(=O)(=O)NCC2CCN(C2)C(=O)C2CCN(CC2)c2ccncc2)s1
InChI Key InChIKey=YEBAGUYJYNTFNJ-RIYZIHGNSA-N
Data  1 IC50
  Tab Delimited (TSV)   2D SDfile   Computed 3D by Vconf -m prep SDfile
Find this compound or compounds like it in BindingDB:
Activity Spreadsheet -- Enzyme Inhibition Constant Data from BindingDB
Found 1 hit for monomerid = 50222064
TargetCoagulation factor X(Homo sapiens (Human))
Bristol-Myers Squibb Pharmaceutical Research Institute
Curated by ChEMBL
LigandPNGBDBM50222064((E)-2-(5-bromothiophen-2-yl)-N-((1-(1-(pyridin-4-y...)
Affinity DataIC50:  86nM. Assay description: Inhibition of F10a
In DepthDetails ArticlePubMed