BDBM50222071 (R,E)-2-(5-chlorothiophen-2-yl)-N-((1-(1-(2-methylpyrimidin-4-yl)piperidine-4-carbonyl)pyrrolidin-3-yl)methyl)ethenesulfonamide::CHEMBL250645
SMILES Cc1nccc(n1)N1CCC(CC1)C(=O)N1CC[C@@H](CNS(=O)(=O)\C=C\c2ccc(Cl)s2)C1
InChI Key InChIKey=ZJIKRVGFKZZERW-YJJOXIQCSA-N
Data  1 IC50
  Tab Delimited (TSV)   2D SDfile   Computed 3D by Vconf -m prep SDfile
Find this compound or compounds like it in BindingDB:
Activity Spreadsheet -- Enzyme Inhibition Constant Data from BindingDB
Found 1 hit for monomerid = 50222071
TargetCoagulation factor X(Homo sapiens (Human))
Bristol-Myers Squibb Pharmaceutical Research Institute
Curated by ChEMBL
LigandPNGBDBM50222071((R,E)-2-(5-chlorothiophen-2-yl)-N-((1-(1-(2-methyl...)
Affinity DataIC50:  230nM. Assay description: Inhibition of F10a
In DepthDetails ArticlePubMed