BDBM50222104 CHEMBL93462
SMILES Fc1ccc(Sc2nc3CNC(=O)N(c3cc2Br)c2c(Cl)cccc2Cl)c(F)c1
InChI Key InChIKey=MCPLQNVFYKDLMI-UHFFFAOYSA-N
Data  1 IC50
  Tab Delimited (TSV)   2D SDfile   Computed 3D by Vconf -m prep SDfile
Find this compound or compounds like it in BindingDB:
Activity Spreadsheet -- Enzyme Inhibition Constant Data from BindingDB
Found 1 hit for monomerid = 50222104
TargetMitogen-activated protein kinase 13(Mus musculus)
Merck Research Laboratories
Curated by ChEMBL
LigandPNGBDBM50222104(CHEMBL93462)
Affinity DataIC50:  16nM. Assay description: Inhibitory activity against mouse Mitogen-activated protein kinase p38
In DepthDetails ArticlePubMed