BDBM50222193 CHEBI:28611::CHEMBL349584
SMILES [H][C@@]1(Cc2ccc(OC)c(O)c2)NCCc2cc(OC)c(O)cc12
InChI Key InChIKey=FVEMXQCEJGGXJB-AWEZNQCLSA-N
Data  3 KI
  Tab Delimited (TSV)   2D SDfile   Computed 3D by Vconf -m prep SDfile
Find this compound or compounds like it in BindingDB:
Activity Spreadsheet -- Enzyme Inhibition Constant Data from BindingDB
Found 3 hits for monomerid = 50222193
TargetBeta-1/Beta-2/Beta-3 adrenergic receptor(Rattus norvegicus (Rat))
TBA
Curated by ChEMBL
LigandPNGBDBM50222193(CHEBI:28611 | CHEMBL349584)
Affinity DataKi:  1.30E+3nM. Assay description: Inhibition of [3H]dihydroalprenolol binding to Beta adrenergic receptor from rat cerebral cortical membranes
In DepthDetails ArticlePubMed
TargetD(1A)/D(1B)/D(2)/D(3)/D(4) dopamine receptor(Rattus norvegicus (rat))
TBA
Curated by ChEMBL
LigandPNGBDBM50222193(CHEBI:28611 | CHEMBL349584)
Affinity DataKi:  1.50E+3nM. Assay description: Inhibition of [3H]spiroperidol binding to dopamine receptor from rat striatum membranes
In DepthDetails ArticlePubMed
LigandPNGBDBM50222193(CHEBI:28611 | CHEMBL349584)
Affinity DataKi:  5.00E+3nM. Assay description: Inhibition of [3H]WB-4101 binding to alpha adrenergic receptor from rat cerebral cortical membranes
In DepthDetails ArticlePubMed