BDBM50222281 3-hydroxy-2-propyl-4H-benzopyran-4-one::CHEMBL394258
SMILES CC(C)c1oc2ccccc2c(=O)c1O
InChI Key InChIKey=KPSBZQIKIRVVTK-UHFFFAOYSA-N
Data  3 IC50
  Tab Delimited (TSV)   2D SDfile   Computed 3D by Vconf -m prep SDfile
Find this compound or compounds like it in BindingDB:
Activity Spreadsheet -- Enzyme Inhibition Constant Data from BindingDB
Found 3 hits for monomerid = 50222281
TargetPolyunsaturated fatty acid lipoxygenase ALOX15B(Homo sapiens (Human))
Universidad De Santiago De Chile
Curated by ChEMBL
LigandPNGBDBM50222281(3-hydroxy-2-propyl-4H-benzopyran-4-one | CHEMBL394...)
Affinity DataIC50: >1.00E+5nM. Assay description: Inhibition of 15-hLO2
In DepthDetails ArticlePubMed
TargetPolyunsaturated fatty acid lipoxygenase ALOX15(Homo sapiens (Human))
Universidad De Santiago De Chile
Curated by ChEMBL
LigandPNGBDBM50222281(3-hydroxy-2-propyl-4H-benzopyran-4-one | CHEMBL394...)
Affinity DataIC50: >1.00E+5nM. Assay description: Inhibition of 15-hLO1
In DepthDetails ArticlePubMed
TargetPolyunsaturated fatty acid lipoxygenase ALOX12(Homo sapiens (Human))
Universidad De Santiago De Chile
Curated by ChEMBL
LigandPNGBDBM50222281(3-hydroxy-2-propyl-4H-benzopyran-4-one | CHEMBL394...)
Affinity DataIC50: >1.00E+5nM. Assay description: Inhibition of 12-hLO
In DepthDetails ArticlePubMed