BDBM50222300 6,7-dihydroxy-2-t-butylbenzopyran-4-one::CHEMBL394257
SMILES CC(C)(C)c1cc(=O)c2cc(O)c(O)cc2o1
InChI Key InChIKey=ZQWUTROGYWCKJU-UHFFFAOYSA-N
Data  3 IC50
  Tab Delimited (TSV)   2D SDfile   Computed 3D by Vconf -m prep SDfile
Find this compound or compounds like it in BindingDB:
Activity Spreadsheet -- Enzyme Inhibition Constant Data from BindingDB
Found 3 hits for monomerid = 50222300
TargetPolyunsaturated fatty acid lipoxygenase ALOX15B(Homo sapiens (Human))
Universidad De Santiago De Chile
Curated by ChEMBL
LigandPNGBDBM50222300(6,7-dihydroxy-2-t-butylbenzopyran-4-one | CHEMBL39...)
Affinity DataIC50: >1.00E+5nM. Assay description: Inhibition of 15-hLO2
In DepthDetails ArticlePubMed
TargetPolyunsaturated fatty acid lipoxygenase ALOX15(Homo sapiens (Human))
Universidad De Santiago De Chile
Curated by ChEMBL
LigandPNGBDBM50222300(6,7-dihydroxy-2-t-butylbenzopyran-4-one | CHEMBL39...)
Affinity DataIC50:  1.80E+4nM. Assay description: Inhibition of 15-hLO1
In DepthDetails ArticlePubMed
TargetPolyunsaturated fatty acid lipoxygenase ALOX12(Homo sapiens (Human))
Universidad De Santiago De Chile
Curated by ChEMBL
LigandPNGBDBM50222300(6,7-dihydroxy-2-t-butylbenzopyran-4-one | CHEMBL39...)
Affinity DataIC50: >1.00E+5nM. Assay description: Inhibition of 12-hLO
In DepthDetails ArticlePubMed