BDBM50222360 Ac-Asp-Arg-Leu-Asp-Ser-OH::CHEMBL238484
SMILES [#6]-[#6](-[#6])-[#6]-[#6@H](-[#7]-[#6](=O)-[#6@H](-[#6]-[#6]-[#6]\[#7]=[#6](\[#7])-[#7])-[#7]-[#6](=O)-[#6@H](-[#6]-[#6](-[#8])=O)-[#7]-[#6](-[#6])=O)-[#6](=O)-[#7]-[#6@@H](-[#6]-[#6](-[#8])=O)-[#6](=O)-[#7]-[#6@@H](-[#6]-[#8])-[#6](-[#8])=O
InChI Key InChIKey=MBZXDXZGPJKBRJ-WOYTXXSLSA-N
Data  8 IC50  3 EC50
  Tab Delimited (TSV)   2D SDfile   Computed 3D by Vconf -m prep SDfile
Find this compound or compounds like it in BindingDB:
Activity Spreadsheet -- Enzyme Inhibition Constant Data from BindingDB
Found 11 hits for monomerid = 50222360
TargetIntegrin alpha-V/beta-3(Homo sapiens (Human))
University Of Bologna
Curated by ChEMBL
LigandPNGBDBM50222360(Ac-Asp-Arg-Leu-Asp-Ser-OH | CHEMBL238484)
Affinity DataIC50:  25nM. Assay description: Antagonist activity at alphavbeta3 integrin in human SK-MEL-24 cells assessed as inhibition of fibronectin-mediated cell adhesion after 30 mins by fl...
In DepthDetails ArticlePubMed
TargetIntegrin alpha-V/beta-3(Homo sapiens (Human))
University Of Bologna
Curated by ChEMBL
LigandPNGBDBM50222360(Ac-Asp-Arg-Leu-Asp-Ser-OH | CHEMBL238484)
Affinity DataIC50:  25nM. Assay description: Inhibition of integrin alphavbeta3-mediated SK-MEL-24 cell adhesion to fibronectin
In DepthDetails ArticlePubMed
TargetIntegrin alpha-5/beta-1(Homo sapiens (Human))
Università
Curated by ChEMBL
LigandPNGBDBM50222360(Ac-Asp-Arg-Leu-Asp-Ser-OH | CHEMBL238484)
Affinity DataIC50:  2.59E+5nM. Assay description: Inhibition of integrin alpha5beta1-mediated K562 cell adhesion to fibronectin
In DepthDetails ArticlePubMed
TargetIntegrin alpha-V/beta-3(Homo sapiens (Human))
University Of Bologna
Curated by ChEMBL
LigandPNGBDBM50222360(Ac-Asp-Arg-Leu-Asp-Ser-OH | CHEMBL238484)
Affinity DataIC50:  25nM. Assay description: Antagonist activity at alphaVbeta3 in human SK-MEL-24 cells assessed as reduction in cell adhesion to fibronectin pre-incubated for 30 mins before fi...
In DepthDetails ArticlePubMed
TargetIntegrin alpha-V/beta-5(Homo sapiens (Human))
University Of Bologna
Curated by ChEMBL
LigandPNGBDBM50222360(Ac-Asp-Arg-Leu-Asp-Ser-OH | CHEMBL238484)
Affinity DataIC50:  2.28E+3nM. Assay description: Antagonist activity at alphaVbeta5 in human MCF7 cells assessed as reduction in cell adhesion to fibrinogen pre-incubated for 30 mins before fibrinog...
In DepthDetails ArticlePubMed
TargetIntegrin alpha-IIb/beta-3(Homo sapiens (Human))
University Of Bologna
Curated by ChEMBL
LigandPNGBDBM50222360(Ac-Asp-Arg-Leu-Asp-Ser-OH | CHEMBL238484)
Affinity DataIC50: >5.00E+3nM. Assay description: Antagonist activity at alpha2bbeta3 in human HEL cells assessed as reduction in cell adhesion to fibrinogen pre-incubated for 30 mins before fibrinog...
In DepthDetails ArticlePubMed
TargetIntegrin alpha-V/beta-6(Homo sapiens (Human))
University Of Bologna
Curated by ChEMBL
LigandPNGBDBM50222360(Ac-Asp-Arg-Leu-Asp-Ser-OH | CHEMBL238484)
Affinity DataIC50: >5.00E+3nM. Assay description: Antagonist activity at alphaVbeta6 in human HT-29 cells assessed as reduction in cell adhesion to fibronectin pre-incubated for 30 mins before fibron...
In DepthDetails ArticlePubMed
TargetIntegrin alpha-5/beta-1(Homo sapiens (Human))
Università
Curated by ChEMBL
LigandPNGBDBM50222360(Ac-Asp-Arg-Leu-Asp-Ser-OH | CHEMBL238484)
Affinity DataEC50: >5.00E+3nM. Assay description: Agonist activity at alpha5beta1 in human K562 cells assessed as increase in cell adhesion to fibronectin pre-incubated for 30 mins before fibronectin...
In DepthDetails ArticlePubMed
TargetIntegrin alpha-5/beta-1(Homo sapiens (Human))
Università
Curated by ChEMBL
LigandPNGBDBM50222360(Ac-Asp-Arg-Leu-Asp-Ser-OH | CHEMBL238484)
Affinity DataIC50: >5.00E+3nM. Assay description: Antagonist activity at alpha5beta1 in human K562 cells assessed as reduction in cell adhesion to fibronectin pre-incubated for 30 mins before fibrone...
In DepthDetails ArticlePubMed
TargetIntegrin alpha-IIb/beta-3(Homo sapiens (Human))
University Of Bologna
Curated by ChEMBL
LigandPNGBDBM50222360(Ac-Asp-Arg-Leu-Asp-Ser-OH | CHEMBL238484)
Affinity DataEC50: >5.00E+3nM. Assay description: Agonist activity at alpha2bbeta3 in human HEL cells assessed as increase in cell adhesion to fibrinogen pre-incubated for 30 mins before fibrinogen a...
In DepthDetails ArticlePubMed
TargetIntegrin alpha-V/beta-6(Homo sapiens (Human))
University Of Bologna
Curated by ChEMBL
LigandPNGBDBM50222360(Ac-Asp-Arg-Leu-Asp-Ser-OH | CHEMBL238484)
Affinity DataEC50: >5.00E+3nM. Assay description: Agonist activity at alphaVbeta6 in human HT-29 cells assessed as increase in cell adhesion to fibronectin pre-incubated for 30 mins before fibronecti...
In DepthDetails ArticlePubMed