BDBM50222365 CHEMBL340113
SMILES CNC(=O)C(=O)CCCCCCc1ncc(o1)-c1ccc(OC)cc1
InChI Key InChIKey=YMSGNXFVCZLSNI-UHFFFAOYSA-N
Data  1 IC50
  Tab Delimited (TSV)   2D SDfile   Computed 3D by Vconf -m prep SDfile
Find this compound or compounds like it in BindingDB:
Activity Spreadsheet -- Enzyme Inhibition Constant Data from BindingDB
Found 1 hit for monomerid = 50222365
TargetHistone deacetylase (HDAC1 and HDAC2)(Homo sapiens (Human))
Abbott Laboratories
Curated by ChEMBL
LigandPNGBDBM50222365(CHEMBL340113)
Affinity DataIC50:  11nM. Assay description: Inhibitory activity against histone deacetylase (HDAC1 and HDAC2) isolated from K562 erythroleukemia cells
In DepthDetails ArticlePubMed