BDBM50079053 4-(5,7-Dioxo-5,7-dihydro-pyrrolo[3,4-b]pyridin-6-yl)-3-iodo-benzenesulfonamide::BDBM50222541::CHEMBL327933
SMILES NS(=O)(=O)c1ccc(N2C(=O)c3cccnc3C2=O)c(I)c1
InChI Key InChIKey=ZFYVIPOMBDUWLR-UHFFFAOYSA-N
Data  6 KI
  Tab Delimited (TSV)   2D SDfile   Computed 3D by Vconf -m prep SDfile
Find this compound or compounds like it in BindingDB:
Activity Spreadsheet -- Enzyme Inhibition Constant Data from BindingDB
Found 6 hits for monomerid = 50079053
TargetCarbonic anhydrase 2(Homo sapiens (Human))
Universit£
Curated by ChEMBL
LigandPNGBDBM50079053(4-(5,7-Dioxo-5,7-dihydro-pyrrolo[3,4-b]pyridin-6-y...)
Affinity DataKi:  33nM. Assay description: Inhibitory activity against human recombinant carbonic anhydrase II
In DepthDetails ArticlePubMed
TargetCarbonic anhydrase 2(Homo sapiens (Human))
Universit£
Curated by ChEMBL
LigandPNGBDBM50079053(4-(5,7-Dioxo-5,7-dihydro-pyrrolo[3,4-b]pyridin-6-y...)
Affinity DataKi:  33nM. Assay description: Inhibition of human carbonic anhydrase II (CAII)
In DepthDetails ArticlePubMed
TargetCarbonic anhydrase 4(Bos taurus (bovine))
Universit£
Curated by ChEMBL
LigandPNGBDBM50079053(4-(5,7-Dioxo-5,7-dihydro-pyrrolo[3,4-b]pyridin-6-y...)
Affinity DataKi:  70nM. Assay description: Inhibitory activity against bovine lung microsomes carbonic anhydrase isozyme IV (bCA IV).
In DepthDetails ArticlePubMed
TargetCarbonic anhydrase 4(Bos taurus (bovine))
Universit£
Curated by ChEMBL
LigandPNGBDBM50079053(4-(5,7-Dioxo-5,7-dihydro-pyrrolo[3,4-b]pyridin-6-y...)
Affinity DataKi:  70nM. Assay description: Inhibition of bovine carbonic anhydrase IV (CAIV)
In DepthDetails ArticlePubMed
TargetCarbonic anhydrase 1(Homo sapiens (Human))
A.P.S. University
Curated by ChEMBL
LigandPNGBDBM50079053(4-(5,7-Dioxo-5,7-dihydro-pyrrolo[3,4-b]pyridin-6-y...)
Affinity DataKi:  609nM. Assay description: Inhibition of human carbonic anhydrase I (CAI)
In DepthDetails ArticlePubMed
TargetCarbonic anhydrase 1(Homo sapiens (Human))
A.P.S. University
Curated by ChEMBL
LigandPNGBDBM50079053(4-(5,7-Dioxo-5,7-dihydro-pyrrolo[3,4-b]pyridin-6-y...)
Affinity DataKi:  610nM. Assay description: Inhibitory activity against human cloned carbonic anhydrase isozyme I (hCA I, cytosolic form).
In DepthDetails ArticlePubMed