BDBM50222711 CHEMBL350985
SMILES [H][C@@]1(C[C@H](O)[C@H](O)CO1)[C@]1([H])OC(=C[C@H](NC(N)=N)[C@H]1NC(C)=O)C(O)=O
InChI Key InChIKey=PIBTYJJAYFVZOW-SLUCFIACSA-N
Data  1 IC50
  Tab Delimited (TSV)   2D SDfile   Computed 3D by Vconf -m prep SDfile
Find this compound or compounds like it in BindingDB:
Activity Spreadsheet -- Enzyme Inhibition Constant Data from BindingDB
Found 1 hit for monomerid = 50222711
TargetNeuraminidase(Influenza A virus (A/Puerto Rico/8/34/Mount Sinai(...)
Sankyo
Curated by ChEMBL
LigandPNGBDBM50222711(CHEMBL350985)
Affinity DataIC50:  6.84nM. Assay description: Inhibitory concentration against influenza A virus sialidase A/PR/8/34
In DepthDetails ArticlePubMed