BDBM50222747 2-benzamido-6-(4-nitrobenzylthio)-9-beta-D-ribofuranosylpurine::CHEMBL240102
SMILES OC[C@H]1O[C@H]([C@H](O)[C@@H]1O)n1cnc2c(SCc3ccc(cc3)[N+]([O-])=O)nc(NC(=O)c3ccccc3)nc12
InChI Key InChIKey=PDBKCJWISNHEJD-DYVMYPEFSA-N
Data  1 KI
  Tab Delimited (TSV)   2D SDfile   Computed 3D by Vconf -m prep SDfile
Find this compound or compounds like it in BindingDB:
Activity Spreadsheet -- Enzyme Inhibition Constant Data from BindingDB
Found 1 hit for monomerid = 50222747
TargetEquilibrative nucleoside transporter 1(Homo sapiens (Human))
University Of Tennessee Health Sciences Center
Curated by ChEMBL
LigandPNGBDBM50222747(2-benzamido-6-(4-nitrobenzylthio)-9-beta-D-ribofur...)
Affinity DataKi:  315nM. Assay description: Displacement of SAENTA-fluorescein from human ENT1 in K562 cells after 45 mins by flow cytometry
In DepthDetails ArticlePubMed