BDBM50222759 2-dimethylamino-6-(4-nitrobenzylthio)-9-beta-D-ribofuranosylpurine::CHEMBL239451
SMILES CN(C)c1nc(SCc2ccc(cc2)[N+]([O-])=O)c2ncn([C@@H]3O[C@H](CO)[C@@H](O)[C@H]3O)c2n1
InChI Key InChIKey=NAQYYVSISXTIOX-SCFUHWHPSA-N
Data  1 KI
  Tab Delimited (TSV)   2D SDfile   Computed 3D by Vconf -m prep SDfile
Find this compound or compounds like it in BindingDB:
Activity Spreadsheet -- Enzyme Inhibition Constant Data from BindingDB
Found 1 hit for monomerid = 50222759
TargetEquilibrative nucleoside transporter 1(Homo sapiens (Human))
University Of Tennessee Health Sciences Center
Curated by ChEMBL
LigandPNGBDBM50222759(2-dimethylamino-6-(4-nitrobenzylthio)-9-beta-D-rib...)
Affinity DataKi:  429nM. Assay description: Displacement of SAENTA-fluorescein from human ENT1 in K562 cells after 45 mins by flow cytometry
In DepthDetails ArticlePubMed