BDBM50222814 (4-(ethylsulfonyl)-2-(tetrahydrofuran-3-yl)-1,2,3,4-tetrahydropyrrolo[3,4-b]indol-7-yl)(4-methylpiperidin-1-yl)methanone::CHEMBL399346
SMILES CCS(=O)(=O)n1c2CN(Cc2c2cc(ccc12)C(=O)N1CCC(C)CC1)C1CCOC1
InChI Key InChIKey=BHSKDPVGAWQFCB-UHFFFAOYSA-N
Data  2 KI
  Tab Delimited (TSV)   2D SDfile   Computed 3D by Vconf -m prep SDfile
Find this compound or compounds like it in BindingDB:
Activity Spreadsheet -- Enzyme Inhibition Constant Data from BindingDB
Found 2 hits for monomerid = 50222814
TargetCannabinoid receptor 2(Homo sapiens (Human))
Astrazeneca R&D Montreal
Curated by ChEMBL
LigandPNGBDBM50222814((4-(ethylsulfonyl)-2-(tetrahydrofuran-3-yl)-1,2,3,...)
Affinity DataKi:  27.8nM. Assay description: Binding affinity to human CB2 receptor
In DepthDetails ArticlePubMed
TargetCannabinoid receptor 1(Homo sapiens (Human))
Astrazeneca R&D Montreal
Curated by ChEMBL
LigandPNGBDBM50222814((4-(ethylsulfonyl)-2-(tetrahydrofuran-3-yl)-1,2,3,...)
Affinity DataKi:  973nM. Assay description: Binding affinity to human CB1 receptor
In DepthDetails ArticlePubMed