BDBM50222841 (Z)-3-bromo-N-(5-tert-butyl-3-(cyclopropylmethyl)-4-methylthiazol-2(3H)-ylidene)benzamide::CHEMBL247996
SMILES Cc1c(s\c(=N/C(=O)c2cccc(Br)c2)n1CC1CC1)C(C)(C)C
InChI Key InChIKey=NGBMQCUWIZPJCG-UZYVYHOESA-N
Data  2 IC50  1 EC50
  Tab Delimited (TSV)   2D SDfile   Computed 3D by Vconf -m prep SDfile
Find this compound or compounds like it in BindingDB:
Activity Spreadsheet -- Enzyme Inhibition Constant Data from BindingDB
Found 3 hits for monomerid = 50222841
TargetCannabinoid receptor 2(Homo sapiens (Human))
Taisho Pharmaceutical
Curated by ChEMBL
LigandPNGBDBM50222841((Z)-3-bromo-N-(5-tert-butyl-3-(cyclopropylmethyl)-...)
Affinity DataIC50:  1.20nM. Assay description: Displacement of [3H]CP-55940 form human CB2 receptor expressed in CHO cells
In DepthDetails ArticlePubMed
TargetCannabinoid receptor 2(Homo sapiens (Human))
Taisho Pharmaceutical
Curated by ChEMBL
LigandPNGBDBM50222841((Z)-3-bromo-N-(5-tert-butyl-3-(cyclopropylmethyl)-...)
Affinity DataEC50:  0.300nM. Assay description: Agonist activity at human CB2 receptor expressed in CHO cells by [35S]GTP-gamma-S binding assay
In DepthDetails ArticlePubMed
TargetCannabinoid receptor 1(Homo sapiens (Human))
Taisho Pharmaceutical
Curated by ChEMBL
LigandPNGBDBM50222841((Z)-3-bromo-N-(5-tert-butyl-3-(cyclopropylmethyl)-...)
Affinity DataIC50:  53nM. Assay description: Displacement of [3H]CP-55940 form human CB1 receptor expressed in CHO cells
In DepthDetails ArticlePubMed