BDBM50223142 CHEMBL401336::N-((R)-1-((R)-1-isopropyl-2-oxo-2,3,4,5-tetrahydro-1H-benzo[b]azepin-3-ylamino)-1-oxo-3-(2-(trifluoromethoxy)phenyl)propan-2-yl)-4-(trifluoromethyl)benzamide
SMILES CC(C)N1c2ccccc2CC[C@@H](NC(=O)[C@@H](Cc2ccccc2OC(F)(F)F)NC(=O)c2ccc(cc2)C(F)(F)F)C1=O
InChI Key InChIKey=HIDLIVFEUKAWEF-DNQXCXABSA-N
Data  1 IC50
  Tab Delimited (TSV)   2D SDfile   Computed 3D by Vconf -m prep SDfile
Find this compound or compounds like it in BindingDB:
Activity Spreadsheet -- Enzyme Inhibition Constant Data from BindingDB
Found 1 hit for monomerid = 50223142
TargetSodium channel protein type 9 subunit alpha(Homo sapiens (Human))
Merck Research Laboratories
Curated by ChEMBL
LigandPNGBDBM50223142(CHEMBL401336 | N-((R)-1-((R)-1-isopropyl-2-oxo-2,3...)
Affinity DataIC50:  175nM. Assay description: Inhibition of human sodium channel Nav1.7 by FRET assay
In DepthDetails ArticlePubMed