BDBM50223387 1-adamantan-1-yl-3-(6-hydroxyhexyl)urea::CHEMBL245143
SMILES OCCCCCCNC(=O)NC12CC3CC(CC(C3)C1)C2
InChI Key InChIKey=FUMIBHNYGFMWPI-UHFFFAOYSA-N
Data  1 IC50
  Tab Delimited (TSV)   2D SDfile   Computed 3D by Vconf -m prep SDfile
Find this compound or compounds like it in BindingDB:
Activity Spreadsheet -- Enzyme Inhibition Constant Data from BindingDB
Found 1 hit for monomerid = 50223387
TargetBifunctional epoxide hydrolase 2(Homo sapiens (Human))
Department Of Entomology And University Of California Davis Cancer Center
Curated by ChEMBL
LigandPNGBDBM50223387(1-adamantan-1-yl-3-(6-hydroxyhexyl)urea | CHEMBL24...)
Affinity DataIC50:  12nM. Assay description: Inhibition of human recombinant soluble epoxide hydrolase by fluorescent based assay
In DepthDetails ArticlePubMed