BDBM50223450 9-bromo-6-(hydroxymethyl)benzo[h]isoquinolin-1(2H)-one::CHEMBL400661
SMILES OCc1cc2cc[nH]c(=O)c2c2cc(Br)ccc12
InChI Key InChIKey=PXUXIFXXTBTUKX-UHFFFAOYSA-N
Data  1 IC50
  Tab Delimited (TSV)   2D SDfile   Computed 3D by Vconf -m prep SDfile
Find this compound or compounds like it in BindingDB:
Activity Spreadsheet -- Enzyme Inhibition Constant Data from BindingDB
Found 1 hit for monomerid = 50223450
TargetSerine/threonine-protein kinase Chk1(Homo sapiens (Human))
Merck Research Laboratories
Curated by ChEMBL
LigandPNGBDBM50223450(9-bromo-6-(hydroxymethyl)benzo[h]isoquinolin-1(2H)...)
Affinity DataIC50:  440nM. Assay description: Inhibition of human Chk1 expressed in baculovirus by time-resolved fluorescence assay
In DepthDetails ArticlePubMed