BDBM50223715 CHEMBL3706732
SMILES CC(C)C[C@H](NC(=O)c1ccc2Sc3ccccc3Nc2c1)C(=O)N[C@H]1CCOC1O
InChI Key InChIKey=LHPCGJVWVCFFAG-WSJPMQGYSA-N
Data  2 IC50
  Tab Delimited (TSV)   2D SDfile   Computed 3D by Vconf -m prep SDfile
Find this compound or compounds like it in BindingDB:
Activity Spreadsheet -- Enzyme Inhibition Constant Data from BindingDB
Found 2 hits for monomerid = 50223715
TargetCalpain-1 catalytic subunit(Homo sapiens (Human))
Institut Henri Beaufour
Curated by ChEMBL
LigandPNGBDBM50223715(CHEMBL3706732)
Affinity DataIC50:  23nM. Assay description: Inhibitory activity against on human calpain 1
In DepthDetails ArticlePubMed
TargetCalpain-1 catalytic subunit(Homo sapiens (Human))
Institut Henri Beaufour
Curated by ChEMBL
LigandPNGBDBM50223715(CHEMBL3706732)
Affinity DataIC50:  2.35E+4nM. Assay description: Inhibitory activity against on calpain 1 in C6 glial cells
In DepthDetails ArticlePubMed