BDBM50224223 5-isopropyl-2-(4-phenoxyphenylamino)thiazol-4(5H)-one::CHEMBL237000
SMILES CC(C)c1sc(Nc2ccc(Oc3ccccc3)cc2)nc1O
InChI Key InChIKey=ZDROOAJCJFLNPA-UHFFFAOYSA-N
Data  1 KI
  Tab Delimited (TSV)   2D SDfile   Computed 3D by Vconf -m prep SDfile
Find this compound or compounds like it in BindingDB:
Activity Spreadsheet -- Enzyme Inhibition Constant Data from BindingDB
Found 1 hit for monomerid = 50224223
Target11-beta-hydroxysteroid dehydrogenase 1(Homo sapiens (Human))
Amgen
Curated by ChEMBL
LigandPNGBDBM50224223(5-isopropyl-2-(4-phenoxyphenylamino)thiazol-4(5H)-...)
Affinity DataKi:  220nM. Assay description: Inhibition of human 11betaHSD1 by SPA
In DepthDetails ArticlePubMed