BDBM50224326 CHEMBL440979::{4-[(4-benzyloxy-benzoyl)-hydrazonomethyl]-phenoxy}-acetic acid
SMILES OC(=O)COc1ccc(\C=N\NC(=O)c2ccc(OCc3ccccc3)cc2)cc1
InChI Key InChIKey=JKQIQEPIOJUUAL-ZVHZXABRSA-N
Data  1 IC50
  Tab Delimited (TSV)   2D SDfile   Computed 3D by Vconf -m prep SDfile
Find this compound or compounds like it in BindingDB:
Activity Spreadsheet -- Enzyme Inhibition Constant Data from BindingDB
Found 1 hit for monomerid = 50224326
TargetSerotonin N-acetyltransferase(Ovis aries)
Johns Hopkins School Of Medicine
Curated by ChEMBL
LigandPNGBDBM50224326(CHEMBL440979 | {4-[(4-benzyloxy-benzoyl)-hydrazono...)
Affinity DataIC50:  4.02E+5nM. Assay description: Inhibition of ovine AANAT by spectrophotometric assay
In DepthDetails ArticlePubMed