BDBM50224328 6-(4-oxo-5-(2-oxoindolin-3-yl)-2-thioxothiazolidin-3-yl)hexanoic acid::CHEMBL428025
SMILES OC(=O)CCCCCn1c(O)c(sc1=S)C1C(=O)Nc2ccccc12
InChI Key InChIKey=YFWWMHPPKSLURW-UHFFFAOYSA-N
Data  1 IC50
  Tab Delimited (TSV)   2D SDfile   Computed 3D by Vconf -m prep SDfile
Find this compound or compounds like it in BindingDB:
Activity Spreadsheet -- Enzyme Inhibition Constant Data from BindingDB
Found 1 hit for monomerid = 50224328
TargetSerotonin N-acetyltransferase(Ovis aries)
Johns Hopkins School Of Medicine
Curated by ChEMBL
LigandPNGBDBM50224328(6-(4-oxo-5-(2-oxoindolin-3-yl)-2-thioxothiazolidin...)
Affinity DataIC50:  5.29E+4nM. Assay description: Inhibition of ovine AANAT by spectrophotometric assay
In DepthDetails ArticlePubMed