BDBM50224457 (1S,5R)-6-pyridin-3-yl-3,6-diaza-bicyclo[3.2.0]heptane::CHEMBL238452
SMILES C1[C@@H]2CNC[C@@H]2N1c1cccnc1
InChI Key InChIKey=XHYQJTGLPJMMEB-WPRPVWTQSA-N
Data  1 EC50
  Tab Delimited (TSV)   2D SDfile   Computed 3D by Vconf -m prep SDfile
Find this compound or compounds like it in BindingDB:
Activity Spreadsheet -- Enzyme Inhibition Constant Data from BindingDB
Found 1 hit for monomerid = 50224457
TargetNeuronal acetylcholine receptor subunit alpha-4/beta-2(Homo sapiens (Human))
Neuroscience Research
Curated by ChEMBL
LigandPNGBDBM50224457((1S,5R)-6-pyridin-3-yl-3,6-diaza-bicyclo[3.2.0]hep...)
Affinity DataEC50:  2.80E+3nM. Assay description: Agonist activity at recombinant human alpha-4-beta-2 nAChR expressed in HEK293 cells assessed as induction of calcium influx by FLIPR assay
In DepthDetails ArticlePubMed