BDBM50224460 (1S,5R)-6-(5-cyanopyridin-3-yl)-3,6-diazabicyclo[3.2.0]-heptane::CHEMBL239931
SMILES N#Cc1cncc(c1)N1C[C@@H]2CNC[C@H]12
InChI Key InChIKey=GPXAWLDGWSBLKM-ONGXEEELSA-N
Data  1 EC50
  Tab Delimited (TSV)   2D SDfile   Computed 3D by Vconf -m prep SDfile
Find this compound or compounds like it in BindingDB:
Activity Spreadsheet -- Enzyme Inhibition Constant Data from BindingDB
Found 1 hit for monomerid = 50224460
TargetNeuronal acetylcholine receptor subunit alpha-4/beta-2(Homo sapiens (Human))
Neuroscience Research
Curated by ChEMBL
LigandPNGBDBM50224460((1S,5R)-6-(5-cyanopyridin-3-yl)-3,6-diazabicyclo[3...)
Affinity DataEC50:  1.14E+4nM. Assay description: Agonist activity at recombinant human alpha-4-beta-2 nAChR expressed in HEK293 cells assessed as induction of calcium influx by FLIPR assay
In DepthDetails ArticlePubMed