BDBM50224465 (1R,5S)-6-(6-chloro-5-methylpyridin-3-yl)-3,6-diazabicyclo-[3.2.0]heptane::CHEMBL395936
SMILES Cc1cc(cnc1Cl)N1C[C@H]2CNC[C@@H]12
InChI Key InChIKey=GCTVZTULKNGORX-PSASIEDQSA-N
Data  1 EC50
  Tab Delimited (TSV)   2D SDfile   Computed 3D by Vconf -m prep SDfile
Find this compound or compounds like it in BindingDB:
Activity Spreadsheet -- Enzyme Inhibition Constant Data from BindingDB
Found 1 hit for monomerid = 50224465
TargetNeuronal acetylcholine receptor subunit alpha-4/beta-2(Homo sapiens (Human))
Neuroscience Research
Curated by ChEMBL
LigandPNGBDBM50224465((1R,5S)-6-(6-chloro-5-methylpyridin-3-yl)-3,6-diaz...)
Affinity DataEC50:  200nM. Assay description: Agonist activity at recombinant human alpha-4-beta-2 nAChR expressed in HEK293 cells assessed as induction of calcium influx by FLIPR assay
In DepthDetails ArticlePubMed