BDBM50224776 2-chloro-N6-cyclopentyl-9H-(2-C-methyl-5-N-propylthiocarbamoyl-beta-D-ribofuranosyl)adenine::CHEMBL254270
SMILES CCCNC(=S)OC[C@H]1O[C@@H](n2cnc3c(NC4CCCC4)nc(Cl)nc23)[C@](C)(O)[C@@H]1O
InChI Key InChIKey=UYHXBFMNMPXEII-DPBUJNAFSA-N
Data  2 KI
  Tab Delimited (TSV)   2D SDfile   Computed 3D by Vconf -m prep SDfile
Find this compound or compounds like it in BindingDB:
Activity Spreadsheet -- Enzyme Inhibition Constant Data from BindingDB
Found 2 hits for monomerid = 50224776
TargetAdenosine receptor A1(BOVINE)
Universit£
Curated by ChEMBL
LigandPNGBDBM50224776(2-chloro-N6-cyclopentyl-9H-(2-C-methyl-5-N-propylt...)
Affinity DataKi:  75nM. Assay description: Displacement of [3H]CCPA from adenosine A1 receptor in bovine cortical membrane
In DepthDetails ArticlePubMed
TargetAdenosine receptor A1(GUINEA PIG)
Universit£
Curated by ChEMBL
LigandPNGBDBM50224776(2-chloro-N6-cyclopentyl-9H-(2-C-methyl-5-N-propylt...)
Affinity DataKi:  337nM. Assay description: Displacement of [3H]CCPA from adenosine A1 receptor in pig cortical membrane
In DepthDetails ArticlePubMed