BDBM50224779 2-chloro-N6-cyclopentyl-9H-(2-C-methyl-5-N-cyclopentylcarbamoyl-beta-D-ribofuranosyl)adenine::CHEMBL427718
SMILES C[C@@]1(O)[C@H](O)[C@@H](COC(=O)NC2CCCC2)O[C@H]1n1cnc2c(NC3CCCC3)nc(Cl)nc12
InChI Key InChIKey=YJPHLIIWWKMHRA-VMEXJKBYSA-N
Data  4 KI
  Tab Delimited (TSV)   2D SDfile   Computed 3D by Vconf -m prep SDfile
Find this compound or compounds like it in BindingDB:
Activity Spreadsheet -- Enzyme Inhibition Constant Data from BindingDB
Found 4 hits for monomerid = 50224779
TargetAdenosine receptor A1(BOVINE)
Universit£
Curated by ChEMBL
LigandPNGBDBM50224779(2-chloro-N6-cyclopentyl-9H-(2-C-methyl-5-N-cyclope...)
Affinity DataKi:  66nM. Assay description: Displacement of [3H]CCPA from adenosine A1 receptor in bovine cortical membrane
In DepthDetails ArticlePubMed
TargetAdenosine receptor A1(GUINEA PIG)
Universit£
Curated by ChEMBL
LigandPNGBDBM50224779(2-chloro-N6-cyclopentyl-9H-(2-C-methyl-5-N-cyclope...)
Affinity DataKi:  370nM. Assay description: Displacement of [3H]CCPA from adenosine A1 receptor in pig cortical membrane
In DepthDetails ArticlePubMed
TargetAdenosine receptor A1(GUINEA PIG)
Universit£
Curated by ChEMBL
LigandPNGBDBM50224779(2-chloro-N6-cyclopentyl-9H-(2-C-methyl-5-N-cyclope...)
Affinity DataKi:  4.70E+3nM. Assay description: Displacement of [3H]CGS21680 from adenosine A1 receptor in pig striatum membrane
In DepthDetails ArticlePubMed
TargetAdenosine receptor A1(BOVINE)
Universit£
Curated by ChEMBL
LigandPNGBDBM50224779(2-chloro-N6-cyclopentyl-9H-(2-C-methyl-5-N-cyclope...)
Affinity DataKi:  1.28E+4nM. Assay description: Displacement of [3H]CGS21680 from adenosine A1 receptor in bovine striatum membrane
In DepthDetails ArticlePubMed