BDBM50224824 2,4-Dihydroxy-Butyramide::CHEMBL366756
SMILES NC(=O)C(O)CCO
InChI Key InChIKey=FVLOHZJVLFKDNU-UHFFFAOYSA-N
Data  1 KI
  Tab Delimited (TSV)   2D SDfile   Computed 3D by Vconf -m prep SDfile
Find this compound or compounds like it in BindingDB:
Activity Spreadsheet -- Enzyme Inhibition Constant Data from BindingDB
Found 1 hit for monomerid = 50224824
TargetAlcohol dehydrogenase E/S chain(Equus caballus)
TBA
Curated by ChEMBL
LigandPNGBDBM50224824(2,4-Dihydroxy-Butyramide | CHEMBL366756)
Affinity DataKi:  5.80E+6nM. Assay description: In vitro inhibition against horse liver alcohol dehydrogenase
In DepthDetails ArticlePubMed