BDBM50224835 2-Methoxy-Acetamide::METHOXYACETAMIDE
SMILES COCC(N)=O
InChI Key InChIKey=MTEZLAATISORQK-UHFFFAOYSA-N
Data  1 KI
  Tab Delimited (TSV)   2D SDfile   Computed 3D by Vconf -m prep SDfile
Find this compound or compounds like it in BindingDB:
Activity Spreadsheet -- Enzyme Inhibition Constant Data from BindingDB
Found 1 hit for monomerid = 50224835
TargetAlcohol dehydrogenase E/S chain(Equus caballus)
TBA
Curated by ChEMBL
LigandPNGBDBM50224835(2-Methoxy-Acetamide | METHOXYACETAMIDE)
Affinity DataKi:  6.00E+5nM. Assay description: In vitro inhibition against horse liver alcohol dehydrogenase
In DepthDetails ArticlePubMed