BDBM50224864 CYCLOHEXANE CARBOXAMIDE::Cyclohexanecarboxylic Acid Amide
SMILES NC(=O)C1CCCCC1
InChI Key InChIKey=PNZXMIKHJXIPEK-UHFFFAOYSA-N
Data  1 KI
PDB links: 1 PDB ID matches this monomer.
  Tab Delimited (TSV)   2D SDfile   Computed 3D by Vconf -m prep SDfile
Find this compound or compounds like it in BindingDB:
Activity Spreadsheet -- Enzyme Inhibition Constant Data from BindingDB
Found 1 hit for monomerid = 50224864
TargetAlcohol dehydrogenase E/S chain(Equus caballus)
TBA
Curated by ChEMBL
LigandPNGBDBM50224864(CYCLOHEXANE CARBOXAMIDE | Cyclohexanecarboxylic Ac...)
Affinity DataKi:  2.50E+5nM. Assay description: In vitro inhibition against horse liver alcohol dehydrogenase
In DepthDetails ArticlePubMed