BDBM50225231 3-methoxy-4-phenoxybenzoic acid::CHEMBL392872
SMILES COc1cc(ccc1Oc1ccccc1)C(O)=O
InChI Key InChIKey=BHLHNTNYVDUKFV-UHFFFAOYSA-N
Data  1 IC50
PDB links: 1 PDB ID matches this monomer.
  Tab Delimited (TSV)   2D SDfile   Computed 3D by Vconf -m prep SDfile
Find this compound or compounds like it in BindingDB:
Activity Spreadsheet -- Enzyme Inhibition Constant Data from BindingDB
Found 1 hit for monomerid = 50225231
TargetTransthyretin(Homo sapiens (Human))
Institute Of Sciences
Curated by ChEMBL
LigandPNGBDBM50225231(3-methoxy-4-phenoxybenzoic acid | CHEMBL392872)
Affinity DataIC50:  4.10E+4nMpH: 4.4Assay Description:Inhibition of transthyretin fibril formation at pH 4.4