BDBM50225312 CHEMBL14506
SMILES [H][C@@](O)(C#C)C12CCCC1C1CCC3=CC(=O)CC[C@]3([H])C1CC2
InChI Key InChIKey=IZGXVVBRWLAGSV-CYAQNONDSA-N
Data  1 Kd
  Tab Delimited (TSV)   2D SDfile   Computed 3D by Vconf -m prep SDfile
Find this compound or compounds like it in BindingDB:
Activity Spreadsheet -- Enzyme Inhibition Constant Data from BindingDB
Found 1 hit for monomerid = 50225312
TargetEstrogen receptor beta(RAT)
TBA
Curated by ChEMBL
LigandPNGBDBM50225312(CHEMBL14506)
Affinity DataKd:  730nM. Assay description: Equilibrium dissociation constant for rat uterine estrogen receptor binding [3H]estradiol
In DepthDetails ArticlePubMed