BDBM50225385 CHEMBL391537::pinacol 5-[(4-morpholin-4-yl-phenylamino)methyl]benzo[b]-thiophen-2-ylboronate
SMILES OB(O)c1cc2cc(CNc3ccc(cc3)N3CCOCC3)ccc2s1
InChI Key InChIKey=XERIMYALBKZDJZ-UHFFFAOYSA-N
Data  1 KI
  Tab Delimited (TSV)   2D SDfile   Computed 3D by Vconf -m prep SDfile
Find this compound or compounds like it in BindingDB:
Activity Spreadsheet -- Enzyme Inhibition Constant Data from BindingDB
Found 1 hit for monomerid = 50225385
TargetBeta-lactamase TEM(Escherichia coli)
Università
Curated by ChEMBL
LigandPNGBDBM50225385(CHEMBL391537 | pinacol 5-[(4-morpholin-4-yl-phenyl...)
Affinity DataKi:  800nM. Assay description: Inhibition of Escherichia coli beta-lactamase
In DepthDetails ArticlePubMed