BDBM50225798 (E)-3-(7-(2-(4-methoxyphenyl)ethynyl)-4-oxo-4,5-dihydro-3H-benzo[b][1,4]diazepin-2-yl)benzonitrile::CHEMBL237944
SMILES COc1ccc(cc1)C#Cc1ccc2N=C(CC(=O)Nc2c1)c1cccc(c1)C#N
InChI Key InChIKey=YQCISTWYORXBED-UHFFFAOYSA-N
Data  1 IC50
  Tab Delimited (TSV)   2D SDfile   Computed 3D by Vconf -m prep SDfile
Find this compound or compounds like it in BindingDB:
Activity Spreadsheet -- Enzyme Inhibition Constant Data from BindingDB
Found 1 hit for monomerid = 50225798
TargetMetabotropic glutamate receptor 2(Homo sapiens (Human))
F. Hoffmann-La Roche
Curated by ChEMBL
LigandPNGBDBM50225798((E)-3-(7-(2-(4-methoxyphenyl)ethynyl)-4-oxo-4,5-di...)
Affinity DataIC50:  68nM. Assay description: Displacement of [3H]LY354740 from rat mGluR2 expressed in CHO cells
In DepthDetails ArticlePubMed