BDBM50226160 CHEMBL261621::GFPEGG
SMILES NCC(=O)N[C@@H](Cc1ccccc1)C(=O)N1CCC[C@H]1C(=O)N[C@@H](CCC(O)=O)C(=O)NCC(=O)NCC(O)=O
InChI Key InChIKey=WXUQGIGEEDNHIW-BZSNNMDCSA-N
Data  2 IC50
  Tab Delimited (TSV)   2D SDfile   Computed 3D by Vconf -m prep SDfile
Find this compound or compounds like it in BindingDB:
Activity Spreadsheet -- Enzyme Inhibition Constant Data from BindingDB
Found 2 hits for monomerid = 50226160
Target3-hydroxy-3-methylglutaryl-coenzyme A reductase(Mesocricetus auratus)
Korea Food Research Institute
Curated by ChEMBL
LigandPNGBDBM50226160(CHEMBL261621 | GFPEGG)
Affinity DataIC50:  1.70E+3nM. Assay description: Inhibition of Syrian hamster HMGR
In DepthDetails ArticlePubMed
Target3-hydroxy-3-methylglutaryl-coenzyme A reductase(Homo sapiens (Human))
Institute Of The Chemistry Of Plant Substances
Curated by ChEMBL
LigandPNGBDBM50226160(CHEMBL261621 | GFPEGG)
Affinity DataIC50:  1.78E+3nM. Assay description: Inhibition of HMG-CoA reductase by spectrophotometry
In DepthDetails ArticlePubMed