BDBM50226273 CHEMBL3349431
SMILES OCN(CO)[C@H]1C[C@](O)(CO)[C@@H](O)[C@H](O)[C@H]1O
InChI Key InChIKey=FVQHFBXRTUONCK-PQFOHKHZSA-N
Data  2 IC50
  Tab Delimited (TSV)   2D SDfile   Computed 3D by Vconf -m prep SDfile
Find this compound or compounds like it in BindingDB:
Activity Spreadsheet -- Enzyme Inhibition Constant Data from BindingDB
Found 2 hits for monomerid = 50226273
TargetMaltase-glucoamylase(Homo sapiens (Human))
TBA
Curated by ChEMBL
LigandPNGBDBM50226273(CHEMBL3349431)
Affinity DataIC50:  15nM. Assay description: Inhibitory activity against porcine maltase
In DepthDetails ArticlePubMed
TargetSucrase-isomaltase, intestinal(Homo sapiens (Human))
TBA
Curated by ChEMBL
LigandPNGBDBM50226273(CHEMBL3349431)
Affinity DataIC50:  4.60nM. Assay description: Alpha-D-glucosidase inhibitory activity and enzyme inhibition in vitro against porcine sucrase
In DepthDetails ArticlePubMed