BDBM50226434 CHEMBL392540::[L-arginyl]-N-[2-(indol-3-yl)ethyl]glycine 2-(indol-3-yl)ethylamide
SMILES N[C@@H](CCCN=C(N)N)C(=O)N(CCc1c[nH]c2ccccc12)CC(=O)NCCc1c[nH]c2ccccc12
InChI Key InChIKey=BTNIEEZBAKYWSE-QHCPKHFHSA-N
Data  2 IC50
  Tab Delimited (TSV)   2D SDfile   Computed 3D by Vconf -m prep SDfile
Find this compound or compounds like it in BindingDB:
Activity Spreadsheet -- Enzyme Inhibition Constant Data from BindingDB
Found 2 hits for monomerid = 50226434
TargetTransient receptor potential cation channel subfamily V member 1(Rattus norvegicus (rat))
University Of Barcelona
Curated by ChEMBL
LigandPNGBDBM50226434(CHEMBL392540 | [L-arginyl]-N-[2-(indol-3-yl)ethyl]...)
Affinity DataIC50:  1.10E+3nM. Assay description: Blockade of capsaicin-activated rat TRPV1 channel expressed in Xenopus oocytes
In DepthDetails ArticlePubMed
TargetGlutamate receptor ionotropic, NMDA 1/2A(Rattus norvegicus (Rat))
University Of Barcelona
Curated by ChEMBL
LigandPNGBDBM50226434(CHEMBL392540 | [L-arginyl]-N-[2-(indol-3-yl)ethyl]...)
Affinity DataIC50:  1.80E+4nM. Assay description: Blockade of L-glutamate/glycine-activated rat NR1/NR2A NMDA receptor expressed in Xenopus oocytes
In DepthDetails ArticlePubMed