BDBM50226525 CHEMBL26652
SMILES CCCCCc1nccn1Cc1ccc(NC(=O)c2ccccc2C(O)=O)cc1
InChI Key InChIKey=AHLTZWZXMWHACI-UHFFFAOYSA-N
Data  1 IC50
  Tab Delimited (TSV)   2D SDfile   Computed 3D by Vconf -m prep SDfile
Find this compound or compounds like it in BindingDB:
Activity Spreadsheet -- Enzyme Inhibition Constant Data from BindingDB
Found 1 hit for monomerid = 50226525
LigandPNGBDBM50226525(CHEMBL26652)
Affinity DataIC50:  240nM. Assay description: Inhibitory concentration that gave 50 percent displacement of specific binding of [3H]AII (2 nM) to Angiotensin ll receptor
In DepthDetails ArticlePubMed