BDBM50226728 CHEMBL26321
SMILES CCCCc1ncc(CO)n1Cc1ccc(cc1)-c1cccc(c1)C(O)=O
InChI Key InChIKey=FUESGOLYMQEEET-UHFFFAOYSA-N
Data  1 IC50
  Tab Delimited (TSV)   2D SDfile   Computed 3D by Vconf -m prep SDfile
Find this compound or compounds like it in BindingDB:
Activity Spreadsheet -- Enzyme Inhibition Constant Data from BindingDB
Found 1 hit for monomerid = 50226728
LigandPNGBDBM50226728(CHEMBL26321)
Affinity DataIC50:  1.10E+3nM. Assay description: Ability to displace [3H]AII (2 nM) from its specific binding sites in rat adrenal cortical microsome preparation
In DepthDetails ArticlePubMed