BDBM50226740 CHEMBL26838
SMILES CCSc1ncc(CO)n1Cc1ccc(OCc2ccccc2C(O)=O)cc1
InChI Key InChIKey=JIQKIYJWJXUEEB-UHFFFAOYSA-N
Data  1 IC50
  Tab Delimited (TSV)   2D SDfile   Computed 3D by Vconf -m prep SDfile
Find this compound or compounds like it in BindingDB:
Activity Spreadsheet -- Enzyme Inhibition Constant Data from BindingDB
Found 1 hit for monomerid = 50226740
LigandPNGBDBM50226740(CHEMBL26838)
Affinity DataIC50:  1.20E+4nM. Assay description: Ability to displace [3H]AII (2 nM) from its specific binding sites in rat adrenal cortical microsome preparation
In DepthDetails ArticlePubMed