BDBM50226953 CHEMBL38790
SMILES [H][C@@]1(C)Cc2ccccc2N(C)[C@]1([H])C1=NCCN1
InChI Key InChIKey=CQKIHIPTCYCQSO-MFKMUULPSA-N
Data  1 KI
  Tab Delimited (TSV)   2D SDfile   Computed 3D by Vconf -m prep SDfile
Find this compound or compounds like it in BindingDB:
Activity Spreadsheet -- Enzyme Inhibition Constant Data from BindingDB
Found 1 hit for monomerid = 50226953
LigandPNGBDBM50226953(CHEMBL38790)
Affinity DataKi:  719nM. Assay description: Binding affinity against alpha-2 adrenergic receptor was determined by the displacement of [3H]clonidine from rat brain cortical membranes
In DepthDetails ArticlePubMed