BDBM50227122 1-(4-fluorobenzyl)-N-(1-phenethylpiperidin-4-yl)-1H-benzo[d]imidazol-2-amine::CHEMBL58025::[1-(4-Fluoro-benzyl)-1H-benzoimidazol-2-yl]-(1-phenethyl-piperidin-4-yl)-amine
SMILES Fc1ccc(Cn2c(NC3CCN(CCc4ccccc4)CC3)nc3ccccc23)cc1
InChI Key InChIKey=UJYMLOAOICJQRV-UHFFFAOYSA-N
Data  1 KI
  Tab Delimited (TSV)   2D SDfile   Computed 3D by Vconf -m prep SDfile
Find this compound or compounds like it in BindingDB:
Activity Spreadsheet -- Enzyme Inhibition Constant Data from BindingDB
Found 1 hit for monomerid = 50227122
TargetSomatostatin receptor type 5(Homo sapiens (Human))
F. Hoffmann-La Roche
Curated by ChEMBL
LigandPNGBDBM50227122(1-(4-fluorobenzyl)-N-(1-phenethylpiperidin-4-yl)-1...)
Affinity DataKi:  5.00E+3nM. Assay description: Displacement of [125I]11-Tyr somatostatin-14 from human SST5R expressed in CHO cells
In DepthDetails ArticlePubMed